5,5-Dimethyl-1,3-dioxan-2-one

Phase change data

Data compiled by: William E. Acree, Jr., James S. Chickos

Enthalpy of fusion

ΔfusH (kJ/mol) Temperature (K) Reference
5.62387.2Lebedev, Kulagina, et al., 1995

References

Lebedev, Kulagina, et al., 1995
Lebedev, B.V.; Kulagina, T.G.; Telnoy, V.I.; Vasil'ev, V.G., Thermodynamics of 2,2-dimethyltrimethylene carbonate, of its bulk polymerization process and of poly (2,2-dimethyltrimethylene carbonate) from 0 to 470 K at standard pressure, Macromol. Chem. Phys., 1995, 196, 3487-3510. [all data]