n-Valeric acid cis-3-hexenyl ester

Kovats' RI, non-polar column, isothermal

View large format table.

Column type Active phase Temperature (C) I Reference Comment
PackedSE-30150.1243.Ashes and Haken, 1975He, Celatom silanized (62-72 mesh); Column length: 3.7 m

Kovats' RI, non-polar column, temperature ramp

View large format table.

Column type Active phase I Reference Comment
CapillaryCP Sil 8 CB1239.Schwob, Bessiere, et al., 200430. m/0.25 mm/0.25 μm, H2, 50. C @ 2. min, 3. K/min; Tend: 220. C

Van Den Dool and Kratz RI, non-polar column, temperature ramp

View large format table.

Column type Active phase I Reference Comment
CapillaryHP-5MS1235.8Zhao C.X., Li, et al., 200630. m/0.25 mm/0.25 μm, He, 4. K/min; Tstart: 80. C; Tend: 300. C

Van Den Dool and Kratz RI, polar column, temperature ramp

View large format table.

Column type Active phase I Reference Comment
CapillaryDB-Wax1518.Fröhlich, Duque, et al., 198930. m/0.25 mm/0.25 μm, He, 50. C @ 3. min, 4. K/min; Tend: 250. C
CapillaryDB-Wax1521.Fröhlich, Duque, et al., 198930. m/0.25 mm/0.25 μm, He, 50. C @ 3. min, 4. K/min; Tend: 250. C

Normal alkane RI, non-polar column, custom temperature program

View large format table.

Column type Active phase I Reference Comment
CapillarySE-301270.Vinogradov, 2004Program: not specified

Normal alkane RI, polar column, temperature ramp

View large format table.

Column type Active phase I Reference Comment
CapillaryDB-Wax1554.Werkhoff, Güntert, et al., 199860. m/0.32 mm/0.25 μm, H2, 3. K/min; Tstart: 60. C; Tend: 220. C

References

Ashes and Haken, 1975
Ashes, J.R.; Haken, J.K., Gas chromatography of homologous esters. IX. Structure-retention increments of unsaturated esters, J. Chromatogr., 1975, 111, 1, 171-187, https://doi.org/10.1016/S0021-9673(01)80159-X . [all data]

Schwob, Bessiere, et al., 2004
Schwob, I.; Bessiere, J.-M.; Masotti, V.; Viano, J., Changes in essential oil composition in Saint John's wort (Hypericum perforatum L.) aerial parts during its phenological cycle, Biochem. Syst. Ecol., 2004, 32, 8, 735-745, https://doi.org/10.1016/j.bse.2003.12.005 . [all data]

Zhao C.X., Li, et al., 2006
Zhao C.X.; Li, X.N.; Liang Y.Z.; Fang H.Z.; Huang L.F.; Guo F.Q., Comparative analysis of chemical components of essential oils from different samples of Rhododendron with the help of chemometrics methods, Chemom. Intell. Lab. Syst., 2006, 82, 1-2, 218-228, https://doi.org/10.1016/j.chemolab.2005.08.008 . [all data]

Fröhlich, Duque, et al., 1989
Fröhlich, O.; Duque, C.; Schreier, P., Volatile constituents of curuba (Passiflora mollissima) fruit, J. Agric. Food Chem., 1989, 37, 2, 421-425, https://doi.org/10.1021/jf00086a033 . [all data]

Vinogradov, 2004
Vinogradov, B.A., Production, composition, properties and application of essential oils, 2004, retrieved from http://viness.narod.ru. [all data]

Werkhoff, Güntert, et al., 1998
Werkhoff, P.; Güntert, M.; Krammer, G.; Sommer, H.; Kaulen, J., Vacuum headspace method in aroma research: flavor chemistry of yellow passion fruits, J. Agric. Food Chem., 1998, 46, 3, 1076-1093, https://doi.org/10.1021/jf970655s . [all data]