Phenol, 4-(1-methylpropyl)-2-nitro

Kovats' RI, non-polar column, isothermal

View large format table.

Column type Active phase Temperature (C) I Reference Comment
PackedE-301150.1436.Verevkin, Belen'kaya, et al., 1990He; Column length: 1.0 m

References

Verevkin, Belen'kaya, et al., 1990
Verevkin, S.P.; Belen'kaya, R.S.; Rozhnov, A.M.; Matyushina, V.P., Investigation of the chromatographic behaviour of alkylnitrophenols, Zh. Anal. Khim., 1990, 45, 1786-1790. [all data]