Benzene, 1-fluoro-3-methyl-

Phase change data

Data compiled as indicated in comments:
BS - Robert L. Brown and Stephen E. Stein
TRC - Thermodynamics Research Center, NIST Boulder Laboratories, Chris Muzny director
AC - William E. Acree, Jr., James S. Chickos
DH - Eugene S. Domalski and Elizabeth D. Hearing

Quantity Value Units Method Reference Comment
Tboil389. - 390.KN/APCR Inc., 1990BS
Tboil389.2KN/AWeast and Grasselli, 1989BS
Quantity Value Units Method Reference Comment
Tfus184.0KN/AMeva'a and Lichanot, 1990Uncertainty assigned by TRC = 0.4 K; TRC
Tfus162.35KN/ATimmermans, 1921Uncertainty assigned by TRC = 0.3 K; TRC

Enthalpy of vaporization

ΔvapH (kJ/mol) Temperature (K) Method Reference Comment
41.6265.N/ADykyj, Svoboda, et al., 1999Based on data from 250. - 390. K.; AC
39.2308.AStephenson and Malanowski, 1987Based on data from 293. - 390. K. See also Potter and Saylor, 1951.; AC
40.7266.N/AStull, 1947Based on data from 250. - 389. K.; AC

Antoine Equation Parameters

log10(P) = A − (B / (T + C))
    P = vapor pressure (bar)
    T = temperature (K)

View plot Requires a JavaScript / HTML 5 canvas capable browser.

Temperature (K) A B C Reference Comment
250.8 - 389.4.330711501.055-42.329Stull, 1947Coefficents calculated by NIST from author's data.

Enthalpy of fusion

ΔfusH (kJ/mol) Temperature (K) Method Reference Comment
8.300183.95N/AMeva'a and Lichanot, 1990, 2DH
8.3184.N/ADomalski and Hearing, 1996AC
6.31185.DSCAhmed and Eades, 1972AC

Entropy of fusion

ΔfusS (J/mol*K) Temperature (K) Reference Comment
45.183.95Meva'a and Lichanot, 1990, 2DH

In addition to the Thermodynamics Research Center (TRC) data available from this site, much more physical and chemical property data is available from the following TRC products:

Gas phase ion energetics data

Data evaluated as indicated in comments:
HL - Edward P. Hunter and Sharon G. Lias
L - Sharon G. Lias

Data compiled as indicated in comments:
B - John E. Bartmess
RDSH - Henry M. Rosenstock, Keith Draxl, Bruce W. Steiner, and John T. Herron

Quantity Value Units Method Reference Comment
IE (evaluated)8.91 ± 0.01eVN/AN/AL
Quantity Value Units Method Reference Comment
Proton affinity (review)785.4kJ/molN/AHunter and Lias, 1998HL
Quantity Value Units Method Reference Comment
Gas basicity756.0kJ/molN/AHunter and Lias, 1998HL

Ionization energy determinations

IE (eV) Method Reference Comment
8.92 ± 0.01PIWatanabe, Nakayama, et al., 1962RDSH

Appearance energy determinations

Ion AE (eV) Other Products MethodReferenceComment
C7H6F+11.9 ± 0.1HEITait, Shannon, et al., 1962RDSH

De-protonation reactions

C7H6F- + Hydrogen cation = Benzene, 1-fluoro-3-methyl-

By formula: C7H6F- + H+ = C7H7F

Quantity Value Units Method Reference Comment
Δr1570. ± 8.8kJ/molG+TSCaldwell and Bartmessgas phase; value altered from reference due to change in acidity scale; B
Quantity Value Units Method Reference Comment
Δr1541. ± 8.4kJ/molIMRECaldwell and Bartmessgas phase; value altered from reference due to change in acidity scale; B

Van Den Dool and Kratz RI, non-polar column, temperature ramp

Data compiled by: NIST Mass Spectrometry Data Center, William E. Wallace, director

Column type CapillaryPacked
Active phase OV-1SE-30
Column length (m)  3.05
Carrier gas  He
Substrate  Supelcoport and Chromosorb
Column diameter (mm)
Phase thickness (μm)
Tstart (C) 35.40.
Tend (C) 300.250.
Heat rate (K/min) 8.10.
Initial hold (min)  4.
Final hold (min)  60.
I 761.6774.
ReferenceGautzsch and Zinn, 1996Peng, Ding, et al., 1988
Comment MSDC-RI MSDC-RI

Kovats' RI, non-polar column, isothermal

View large format table.

Column type Active phase Temperature (C) I Reference Comment
PackedSqualane100.756.Vernon and Edwards, 1975N2, DCMS-treated Celite; Column length: 1. m

Kovats' RI, non-polar column, custom temperature program

View large format table.

Column type Active phase I Reference Comment
PackedApiezon M778.0Jalali-Heravi and Garkani-Nejad, 1993Chromosorb W; Column length: 2. m; Program: not specified

Normal alkane RI, non-polar column, isothermal

View large format table.

Column type Active phase Temperature (C) I Reference Comment
CapillaryOV-10199.6783.Tsvetkov, Nesterova, et al., 1987

Normal alkane RI, non-polar column, temperature ramp

View large format table.

Column type Active phase I Reference Comment
CapillaryOV-101769.Zenkevich, 200525. m/0.20 mm/0.10 μm, N2/He, 6. K/min; Tstart: 50. C; Tend: 250. C

Normal alkane RI, non-polar column, custom temperature program

View large format table.

Column type Active phase I Reference Comment
CapillaryMethyl Silicone769.Zenkevich, 1995Program: not specified

Reaction thermochemistry data

Data compiled by: John E. Bartmess

Individual Reactions

C7H6F- + Hydrogen cation = Benzene, 1-fluoro-3-methyl-

By formula: C7H6F- + H+ = C7H7F

Quantity Value Units Method Reference Comment
Δr375.3 ± 2.1kcal/molG+TSCaldwell and Bartmessgas phase; value altered from reference due to change in acidity scale
Quantity Value Units Method Reference Comment
Δr368.2 ± 2.0kcal/molIMRECaldwell and Bartmessgas phase; value altered from reference due to change in acidity scale

References

PCR Inc., 1990
PCR Inc., Research Chemicals Catalog 1990-1991, PCR Inc., Gainesville, FL, 1990, 1. [all data]

Weast and Grasselli, 1989
CRC Handbook of Data on Organic Compounds, 2nd Editon, Weast,R.C and Grasselli, J.G., ed(s)., CRC Press, Inc., Boca Raton, FL, 1989, 1. [all data]

Meva'a and Lichanot, 1990
Meva'a, L.M.; Lichanot, A., Thermodynamic properties in condensed phase of ortho, meta and para fluorotoluene, cresol and toluidine, Thermochim. Acta, 1990, 158, 335. [all data]

Timmermans, 1921
Timmermans, J., The Freezing Points of Organic Substances IV. New Exp. Determinations, Bull. Soc. Chim. Belg., 1921, 30, 62. [all data]

Dykyj, Svoboda, et al., 1999
Dykyj, J.; Svoboda, J.; Wilhoit, R.C.; Frenkel, M.L.; Hall, K.R., Vapor Pressure of Chemicals: Part A. Vapor Pressure and Antoine Constants for Hydrocarbons and Sulfur, Selenium, Tellurium and Hydrogen Containing Organic Compounds, Springer, Berlin, 1999, 373. [all data]

Stephenson and Malanowski, 1987
Stephenson, Richard M.; Malanowski, Stanislaw, Handbook of the Thermodynamics of Organic Compounds, 1987, https://doi.org/10.1007/978-94-009-3173-2 . [all data]

Potter and Saylor, 1951
Potter, John C.; Saylor, John H., The Vapor Pressures and Freezing Points of Some Organic Fluorine Compounds 1,2, J. Am. Chem. Soc., 1951, 73, 1, 90-91, https://doi.org/10.1021/ja01145a032 . [all data]

Stull, 1947
Stull, Daniel R., Vapor Pressure of Pure Substances. Organic and Inorganic Compounds, Ind. Eng. Chem., 1947, 39, 4, 517-540, https://doi.org/10.1021/ie50448a022 . [all data]

Meva'a and Lichanot, 1990, 2
Meva'a, L.M.; Lichanot, A., Proprietes thermodynamiques en phase condensee des ortho, meta et para fluorotoluene, cresol et toluidine, Thermochim. Acta, 1990, 158, 335-345. [all data]

Domalski and Hearing, 1996
Domalski, Eugene S.; Hearing, Elizabeth D., Heat Capacities and Entropies of Organic Compounds in the Condensed Phase. Volume III, J. Phys. Chem. Ref. Data, 1996, 25, 1, 1, https://doi.org/10.1063/1.555985 . [all data]

Ahmed and Eades, 1972
Ahmed, A.M.I.; Eades, R.G., Proton magnetic relaxation in toluene and some derivatives, J. Chem. Soc., Faraday Trans. 2, 1972, 68, 1623, https://doi.org/10.1039/f29726801623 . [all data]