4-Methoxy-4'-dodecoxy-trans-stilbene

Phase change data

Data compiled as indicated in comments:
TRC - Thermodynamics Research Center, NIST Boulder Laboratories, Chris Muzny director
DH - Eugene S. Domalski and Elizabeth D. Hearing

Quantity Value Units Method Reference Comment
Tfus415.KN/AYoung, Haller, et al., 1972Uncertainty assigned by TRC = 1. K; TRC

Enthalpy of fusion

ΔfusH (kJ/mol) Temperature (K) Reference Comment
58.660415.Young, Haller, et al., 1972, 2Crystal-isotropic liquid transition.; DH

Entropy of fusion

ΔfusS (J/mol*K) Temperature (K) Reference Comment
141.3415.Young, Haller, et al., 1972, 2Crystal-isotropic; DH

Enthalpy of phase transition

ΔHtrs (kJ/mol) Temperature (K) Initial Phase Final Phase Reference Comment
21.880409.liquidliquidYoung, Haller, et al., 1972, 2DH

Entropy of phase transition

ΔStrs (J/mol*K) Temperature (K) Initial Phase Final Phase Reference Comment
53.5409.liquid, Smecticliquid, liquid transitionYoung, Haller, et al., 1972, 2DH

In addition to the Thermodynamics Research Center (TRC) data available from this site, much more physical and chemical property data is available from the following TRC products:

References

Young, Haller, et al., 1972
Young, W.R.; Haller, I.; Aviram, A., Mesomorphism in the 4,4'-dialkoxy-trans-stilbene, Mol. Cryst. Liq. Cryst., 1972, 15, 311. [all data]

Young, Haller, et al., 1972, 2
Young, W.R.; Haller, I.; Aviram, A., Mesomorphism in the 4,4'-dialkoxy-trans-stilbenes, Mol. Cryst. Liq. Cryst., 1972, 15, 311-317. [all data]