(Methylthio)-acetonitrile

Gas phase ion energetics data

Data evaluated as indicated in comments:
HL - Edward P. Hunter and Sharon G. Lias

Data compiled as indicated in comments:
B - John E. Bartmess

Quantity Value Units Method Reference Comment
Proton affinity (review)784.8kJ/molN/AHunter and Lias, 1998HL
Quantity Value Units Method Reference Comment
Gas basicity754.1kJ/molN/AHunter and Lias, 1998HL

De-protonation reactions

C3H4NS- + Hydrogen cation = (Methylthio)-acetonitrile

By formula: C3H4NS- + H+ = C3H5NS

Quantity Value Units Method Reference Comment
Δr1496. ± 10.kJ/molG+TSBorn, Ingemann, et al., 1996gas phase; Acidity >CF3CH2OH, comparable to MeNO2; B
Quantity Value Units Method Reference Comment
Δr1464. ± 8.4kJ/molIMRBBorn, Ingemann, et al., 1996gas phase; Acidity >CF3CH2OH, comparable to MeNO2; B

References

Hunter and Lias, 1998
Hunter, E.P.; Lias, S.G., Evaluated Gas Phase Basicities and Proton Affinities of Molecules: An Update, J. Phys. Chem. Ref. Data, 1998, 27, 3, 413-656, https://doi.org/10.1063/1.556018 . [all data]

Born, Ingemann, et al., 1996
Born, M.; Ingemann, S.; Nibbering, N.M.M., Experimental Determination of the Enthalpies of Formation of Formyl Cyanide and Thioformyl Cyanide in the Gas Phase, J. Phys. Chem., 1996, 100, 44, 17662, https://doi.org/10.1021/jp9609141 . [all data]