1,5-Heptadiene, 3,6-dimethyl-

Phase change data

Data compiled by: Thermodynamics Research Center, NIST Boulder Laboratories, Chris Muzny director

Quantity Value Units Method Reference Comment
Tboil407.8KN/AHenne and Chanan, 1944Uncertainty assigned by TRC = 2. K

In addition to the Thermodynamics Research Center (TRC) data available from this site, much more physical and chemical property data is available from the following TRC products:

References

Henne and Chanan, 1944
Henne, A.L.; Chanan, H.H., Diolefins from Allylic Chlorides II., J. Am. Chem. Soc., 1944, 66, 392. [all data]