2-Pentanol, 2-methyl-, acetate

Phase change data

Data compiled as indicated in comments:
BS - Robert L. Brown and Stephen E. Stein
AC - William E. Acree, Jr., James S. Chickos

Quantity Value Units Method Reference Comment
Δvap45.6kJ/molCGCVerevkin and Heintz, 1999Based on data from 333. - 378. K.; AC

Reduced pressure boiling point

Tboil (K) Pressure (bar) Reference Comment
307.70.013Weast and Grasselli, 1989BS

References

Verevkin and Heintz, 1999
Verevkin, Sergey P.; Heintz, Andreas, Determination of Vaporization Enthalpies of the Branched Esters from Correlation Gas Chromatography and Transpiration Methods, J. Chem. Eng. Data, 1999, 44, 6, 1240-1244, https://doi.org/10.1021/je990122a . [all data]

Weast and Grasselli, 1989
CRC Handbook of Data on Organic Compounds, 2nd Editon, Weast,R.C and Grasselli, J.G., ed(s)., CRC Press, Inc., Boca Raton, FL, 1989, 1. [all data]