Decane, 1,1-diethoxy-

Normal alkane RI, non-polar column, custom temperature program

View large format table.

Column type Active phase I Reference Comment
CapillarySE-301473.Vinogradov, 2004Program: not specified

Normal alkane RI, polar column, custom temperature program

View large format table.

Column type Active phase I Reference Comment
CapillarySupelco CO Wax-101622.Prompona, Kandylis, et al., 201260. m/0.32 mm/0.25 μm, Helium; Program: 35 0C (6 min) 2 0C/min -> 60 0C (5 min) 5 0C/min -> 200 0C 25 0C/min -> 250 0C (6 min)
CapillaryCarbowax 20M1613.Vinogradov, 2004Program: not specified

References

Vinogradov, 2004
Vinogradov, B.A., Production, composition, properties and application of essential oils, 2004, retrieved from http://viness.narod.ru. [all data]

Prompona, Kandylis, et al., 2012
Prompona, K.-D.; Kandylis, P.; Tsakiris, A.; Kanellaki, M.; Kourkoutas, Y., Application of alternative technologies for elimination of artificial colorings in alcoholic beverages produced by Citrus medica and potential impact on human health, Food Nutrition Sci., 2012, 3, 07, 959-969, https://doi.org/10.4236/fns.2012.37127 . [all data]