Thallium hexanoate

Condensed phase thermochemistry data

Data compiled by: Eugene S. Domalski and Elizabeth D. Hearing

Quantity Value Units Method Reference Comment
solid,1 bar324.76J/mol*KN/ABoerio-Goates, Lopez de la Fuente, et al., 1985

Constant pressure heat capacity of solid

Cp,solid (J/mol*K) Temperature (K) Reference Comment
234.96298.15Boerio-Goates, Lopez de la Fuente, et al., 1985T = 5 to 500 K.
235.320.Fernandez-Martin, Lopez de la Fuente, et al., 1984T = 320 to 480 K.

References

Boerio-Goates, Lopez de la Fuente, et al., 1985
Boerio-Goates, J.; Lopez de la Fuente, F.L.; Cheda, J.A.R.; Westrum, E.F., Jr., Thermodynamics of thallium alkanoates. I. Heat capacity and thermodynamic functions of thallium(I) n-hexanoate, J. Chem. Thermodynam., 1985, 17, 401-408. [all data]

Fernandez-Martin, Lopez de la Fuente, et al., 1984
Fernandez-Martin, F.; Lopez de la Fuente, F.L.; Cheda, J.A.R., DSC thermophysics on some lower thallium(I) n-alkanoates, Thermochim. Acta, 1984, 73, 109-115. [all data]