1-Chloropyrene

Phase change data

Data compiled by: Thermodynamics Research Center, NIST Boulder Laboratories, Chris Muzny director

Quantity Value Units Method Reference Comment
Tfus392.15KN/AMosnaim, Wolf, et al., 1973Uncertainty assigned by TRC = 2. K; identified as 3-chloro- in paper

In addition to the Thermodynamics Research Center (TRC) data available from this site, much more physical and chemical property data is available from the following TRC products:

References

Mosnaim, Wolf, et al., 1973
Mosnaim, A.D.; Wolf, M.E.; Saavedra, I.; 'Amaro, A.M.; Cardano, G.; Nonhebel, D.C., Reaction of Cupric (II) Halides with Organic Compounds VII. Pyrene Some 3-Substituted Pyrenes, Tetrahedron Lett., 1973, 1973, 1491. [all data]