N-Benzoyl-o-aminodiphenylamine

Condensed phase thermochemistry data

Data compiled as indicated in comments:
ALS - Hussein Y. Afeefy, Joel F. Liebman, and Stephen E. Stein
DH - Eugene S. Domalski and Elizabeth D. Hearing

Quantity Value Units Method Reference Comment
Δfsolid-10. ± 84.kJ/molCcbKaryakin, Rabinovich, et al., 1974ALS
Quantity Value Units Method Reference Comment
Δcsolid-9753. ± 84.kJ/molCcbKaryakin, Rabinovich, et al., 1974ALS
Quantity Value Units Method Reference Comment
solid,1 bar340.7J/mol*KN/AKaryakin, Rabinovich, et al., 1974, 2DH

Constant pressure heat capacity of solid

Cp,solid (J/mol*K) Temperature (K) Reference Comment
356.6298.15Karyakin, Rabinovich, et al., 1974, 2T = 10 to 450 K.; DH

References

Karyakin, Rabinovich, et al., 1974
Karyakin, N.V.; Rabinovich, I.B.; Korshak, V.V.; Rusanov, A.L.; Tugushi, D.S.; Mochalov, A.N.; Sapozhnikov, V.N., Thermodynamics of synthesis of poly-[2,2'-(p-phenylene)-1,1'-diphenyl-5,5'-dibenzimidazole] by intramolecular cyclodehydration of poly[N-terephthalyl-bis-(N'-phenyl-o-diphenylamine)], Polym. Sci. USSR, 1974, 16, 795-803. [all data]

Karyakin, Rabinovich, et al., 1974, 2
Karyakin, N.V.; Rabinovich, I.B.; Korshak, V.V.; Rusanov, A.L.; Tugushi, D.S.; Mochalov, A.N.; Sapozhnikov, V.N., Thermodynamics of synthesis of poly-[2,2'-(p-phenylene)-1,1'-diphenyl-5,5'-dibenzimidazole] by intramolecular cyclodehydration of poly-[N-terephthalyl-bis-(N'-phenyl-o-diphenylamine)], Vysokomol. Soedin., 1974, A16, 691-697. [all data]