3-(Ethylsulphonyl)-1-propene

Condensed phase thermochemistry data

Data compiled by: Hussein Y. Afeefy, Joel F. Liebman, and Stephen E. Stein

Quantity Value Units Method Reference Comment
Δfliquid-406.0 ± 1.0kJ/molCcrMackle and O'Hare, 1961Reanalyzed by Cox and Pilcher, 1970, Original value = -411. ± 1. kJ/mol
Quantity Value Units Method Reference Comment
Δcliquid-3593.1 ± 0.84kJ/molCcrMackle and O'Hare, 1961Reanalyzed by Cox and Pilcher, 1970, Original value = -3583.4 ± 0.8 kJ/mol

References

Mackle and O'Hare, 1961
Mackle, H.; O'Hare, P.A.G., Studies in the thermochemistry of sulphones. Part 6 - Heats of combustion, fusion, vaporization and atomization of six aromatic and two allylic sulphones, Trans. Faraday Soc., 1961, 57, 1521-1526. [all data]

Cox and Pilcher, 1970
Cox, J.D.; Pilcher, G., Thermochemistry of Organic and Organometallic Compounds, Academic Press, New York, 1970, 1-636. [all data]