2-Propanone, O-methyloxime

Reaction thermochemistry data

Data compiled by: John E. Bartmess

Individual Reactions

C4H8NO- + Hydrogen cation = 2-Propanone, O-methyloxime

By formula: C4H8NO- + H+ = C4H9NO

Quantity Value Units Method Reference Comment
Δr1560. ± 17.kJ/molN/AHair, Carrigan, et al., 1989gas phase; Acidity near DMSO.
Quantity Value Units Method Reference Comment
Δr1530. ± 15.kJ/molIMRBHair, Carrigan, et al., 1989gas phase; Acidity near DMSO.

Gas phase ion energetics data

Data compiled as indicated in comments:
B - John E. Bartmess
LBLHLM - Sharon G. Lias, John E. Bartmess, Joel F. Liebman, John L. Holmes, Rhoda D. Levin, and W. Gary Mallard

Ionization energy determinations

IE (eV) Method Reference Comment
9.16PEStunnenberg and Cerfontain, 1987LBLHLM

De-protonation reactions

C4H8NO- + Hydrogen cation = 2-Propanone, O-methyloxime

By formula: C4H8NO- + H+ = C4H9NO

Quantity Value Units Method Reference Comment
Δr372.8 ± 4.0kcal/molN/AHair, Carrigan, et al., 1989gas phase; Acidity near DMSO.; B
Quantity Value Units Method Reference Comment
Δr365.7 ± 3.5kcal/molIMRBHair, Carrigan, et al., 1989gas phase; Acidity near DMSO.; B

References

Hair, Carrigan, et al., 1989
Hair, O.; Carrigan, K.E.; Bierbaum, V.M.; DePuy, C.H., Gas Phase Ion Chemistry of Nitrogen Containing Negative Ions: Deprotonated Nitromethane, Acetone Oxime, and Acetone Oxime O-methyl Ether, Int. J. Mass Spectrom. Ion Proc., 1989, 90, 3, 295, https://doi.org/10.1016/0168-1176(89)80074-6 . [all data]