8b,16b-Dihydrodibenzo[g,p]chrysene mixture of cis and trans

Phase change data

Data compiled by: Hussein Y. Afeefy, Joel F. Liebman, and Stephen E. Stein

Quantity Value Units Method Reference Comment
Δsub182.kJ/molVWittig, Barendt, et al., 1971

References

Wittig, Barendt, et al., 1971
Wittig, G.; Barendt, E.; Schoch, W., Zur Reaktivatat der zentrael Bindung des Dibenzo[g,p]chrysens, Liebigs Ann. Chem., 1971, 749, 24-37. [all data]