Ethanone, 2-(dimethylamino)-1-phenyl-

Phase change data

Data compiled as indicated in comments:
ALS - Hussein Y. Afeefy, Joel F. Liebman, and Stephen E. Stein
AC - William E. Acree, Jr., James S. Chickos

Quantity Value Units Method Reference Comment
Δvap69.66 ± 0.54kJ/molVWelle, Verevkin, et al., 1994ALS
Δvap69.7 ± 0.5kJ/molGSWelle, Verevkin, et al., 1994Based on data from 293. - 333. K.; AC

References

Welle, Verevkin, et al., 1994
Welle, f.; Verevkin, S.P.; Keller, M.; Beckhaus, H.-D.; Ruchardt, C., Kinetische und thermodynamische Stabilitat von 2,3-Bis(dialkylamino)-1,4-diketonen - Stabilisierungsenergie capto-dativ substituierter α-Dialkylamino-α-Carbonylalkyl-Radikale, Chem. Ber., 1994, 127, 697-710. [all data]