3-Cyclobutene-1,2-dione

Gas phase ion energetics data

Data compiled as indicated in comments:
LLK - Sharon G. Lias, Rhoda D. Levin, and Sherif A. Kafafi

Ionization energy determinations

IE (eV) Method Reference Comment
9.79PESchang, Gleiter, et al., 1978Vertical value; LLK

References

Schang, Gleiter, et al., 1978
Schang, P.; Gleiter, R.; Rieker, A., The He(I) photoelectron spectrum of cyclobutene-1,2-dione and o-benzoquinone, Ber. Bunsen-Ges. Phys. Chem., 1978, 82, 629. [all data]