4-Nitroguaiacol

Phase change data

Data compiled by: William E. Acree, Jr., James S. Chickos

Quantity Value Units Method Reference Comment
Δsub99.4 ± 2.0kJ/molCMiranda, Morais, et al., 2004

Enthalpy of fusion

ΔfusH (kJ/mol) Temperature (K) Reference
21.69374.4Miranda, Morais, et al., 2004

References

Miranda, Morais, et al., 2004
Miranda, Margarida S.; Morais, Victor M.F.; Matos, M. Agostinha R., Standard molar enthalpies of formation of the methoxynitrophenol isomers: a combined experimental and theoretical investigation, The Journal of Chemical Thermodynamics, 2004, 36, 5, 431-436, https://doi.org/10.1016/j.jct.2004.02.006 . [all data]