Tacrine

Kovats' RI, non-polar column, custom temperature program

View large format table.

Column type Active phase I Reference Comment
PackedOV-1012160.McLinden and Stenhouse, 1979N2, Chromosorb W; Column length: 2. m; Program: not specified

Normal alkane RI, non-polar column, custom temperature program

View large format table.

Column type Active phase I Reference Comment
CapillaryHP-12140.Schütz, Ahrens, et al., 200112. m/0.20 mm/0.33 μm; Program: 100 0C (12 min) 10 K/min -> 280 0C (5 min) 30 K/min -> 300 0C (10 min)
OtherMethyl Silicone2165.Ardrey and Moffat, 1981Program: not specified

References

McLinden and Stenhouse, 1979
McLinden, V.J.; Stenhouse, A.M., A chromatography system for drug identification, Forensic Sci. Int., 1979, 13, 71-79, https://doi.org/10.1016/0379-0738(79)90265-2 . [all data]

Schütz, Ahrens, et al., 2001
Schütz, H.; Ahrens, B.; Erdmann, F.; Weiler, G., Detection of the cholinesterase inhibitor tacrine and its main metabolites, Arch. Kriminol., 2001, 207, 5/6, 154-161. [all data]

Ardrey and Moffat, 1981
Ardrey, R.E.; Moffat, A.C., Gas-liquid chromatographic retention indices of 1318 substances of toxicological interest on SE-30 or OV-1 stationary phase, J. Chromatogr., 1981, 220, 3, 195-252, https://doi.org/10.1016/S0021-9673(00)81925-1 . [all data]