Benzoic acid, 3,5-dichloro-2-hydroxy-

Normal alkane RI, non-polar column, temperature ramp

View large format table.

Column type Active phase I Reference Comment
CapillarySE-301684.Shakirov, Tsypysheva, et al., 19884. K/min; Column length: 20. m; Column diameter: 0.2 mm; Tstart: 100. C; Tend: 230. C

References

Shakirov, Tsypysheva, et al., 1988
Shakirov, L.G.; Tsypysheva, L.G.; Suleimamova, R.A.; Naimushin, A.I.; Tsypyshev, O.Yu., Gas chromatographic determination of the products of the synthesis of chlorine-substituted salicylic acids, Zh. Anal. Khim., 1988, 43, 143-146. [all data]