Ethynol

Vibrational and/or electronic energy levels

Data compiled by: Marilyn E. Jacox

State:   X

Vib.
sym.
 No.   Approximate
 type of mode
 cm-1   Med.   Method   References

a' 1 OH stretch 3501.3 s Ar IR Hochstrasser and Wirz, 1989
2 CH stretch 3339.6 m Ar IR Hochstrasser and Wirz, 1989
3 CC stretch 2198.3 vs Ar IR Hochstrasser and Wirz, 1989
4 COH bend 1232.1 m Ar IR Hochstrasser and Wirz, 1989
5 CO stretch 1072.1 m Ar IR Hochstrasser and Wirz, 1989
Bend 599 T Ar IR Hochstrasser and Wirz, 1989
Bend 523 T Ar IR Hochstrasser and Wirz, 1989
Bend 383 T Ar IR Hochstrasser and Wirz, 1989
Bend 346 T Ar IR Hochstrasser and Wirz, 1989

Additional references: Jacox, 1994, page 255

References

Hochstrasser and Wirz, 1989
Hochstrasser, R.; Wirz, J., Ethinol: Photochemische Erzeugung in einer Argonmatrix, IR-Spektrum und Photoisomerisierung zu Keten, Angew. Chem., 1989, 101, 2, 183, https://doi.org/10.1002/ange.19891010209 . [all data]

Jacox, 1994
Jacox, M.E., Vibrational and electronic energy levels of polyatomic transient molecules, American Chemical Society, Washington, DC, 1994, 464. [all data]