N,N'-Di-n-hexylsebacamide

Phase change data

Data compiled as indicated in comments:
TRC - Thermodynamics Research Center, NIST Boulder Laboratories, Chris Muzny director
AC - William E. Acree, Jr., James S. Chickos
DH - Eugene S. Domalski and Elizabeth D. Hearing

Quantity Value Units Method Reference Comment
Tfus415.KN/AWilhoit and Dole, 1953Uncertainty assigned by TRC = 1. K; TRC

Enthalpy of fusion

ΔfusH (kJ/mol) Temperature (K) Reference Comment
53.56415.Domalski and Hearing, 1996AC
53.680415.Wilhoit and Dole, 1953, 2DH

Entropy of fusion

ΔfusS (J/mol*K) Temperature (K) Reference Comment
129.3415.Wilhoit and Dole, 1953, 2DH

In addition to the Thermodynamics Research Center (TRC) data available from this site, much more physical and chemical property data is available from the following TRC products:

References

Wilhoit and Dole, 1953
Wilhoit, R.C.; Dole, M., Specific heat of synthetic high polymers. II. Polyhexamethylene adipamide and sebacamide, J. Phys. Chem., 1953, 57, 14. [all data]

Domalski and Hearing, 1996
Domalski, Eugene S.; Hearing, Elizabeth D., Heat Capacities and Entropies of Organic Compounds in the Condensed Phase. Volume III, J. Phys. Chem. Ref. Data, 1996, 25, 1, 1, https://doi.org/10.1063/1.555985 . [all data]

Wilhoit and Dole, 1953, 2
Wilhoit, R.C.; Dole, M., Specific heat of synthetic high polymers. II. Polyhexamethylene adipamide and sebacamide, J. Phys. Chem., 1953, 57, 14-21. [all data]