2-Propenoic acid, 2-methyl-, decyl ester

Phase change data

Data compiled as indicated in comments:
DH - Eugene S. Domalski and Elizabeth D. Hearing
TRC - Thermodynamics Research Center, NIST Boulder Laboratories, Chris Muzny director
AC - William E. Acree, Jr., James S. Chickos

Quantity Value Units Method Reference Comment
Tfus250.7KN/AKarabaev, Abduzhaminov, et al., 1985DH
Tfus250.7KN/AKarabaev, Saidov, et al., 1985DH
Tfus250.7KN/AKarabaev, Abduzhaminov, et al., 1985, 2Uncertainty assigned by TRC = 0.1 K; TRC

Enthalpy of vaporization

ΔvapH (kJ/mol) Temperature (K) Method Reference Comment
62.7365.AStephenson and Malanowski, 1987Based on data from 350. - 541. K.; AC

Enthalpy of fusion

ΔfusH (kJ/mol) Temperature (K) Reference Comment
30.548250.7Karabaev, Abduzhaminov, et al., 1985, 3DH
30.55250.7Domalski and Hearing, 1996AC

Entropy of fusion

ΔfusS (J/mol*K) Temperature (K) Reference Comment
121.9250.7Karabaev, Abduzhaminov, et al., 1985, 3DH

In addition to the Thermodynamics Research Center (TRC) data available from this site, much more physical and chemical property data is available from the following TRC products:

Kovats' RI, polar column, isothermal

Data compiled by: NIST Mass Spectrometry Data Center, William E. Wallace, director

Column type CapillaryCapillary
Active phase SP-1000SP-1000
Column length (m) 46.46.
Carrier gas N2N2
Substrate
Column diameter (mm) 0.230.23
Phase thickness (μm)
Temperature (C) 170.200.
I 1833.1841.
ReferenceHorna, Táborský, et al., 1985Horna, Táborský, et al., 1985
Comment MSDC-RI MSDC-RI

References

Karabaev, Abduzhaminov, et al., 1985
Karabaev, M.; Abduzhaminov, T.P.; Saidov, A.A.; Igamberdyev, Kh.T., Thermophysical properties of liquid methacrylic acid and its simple esters, Izv. Akad. Nauk Uzb. SSR, Ser. Fiz.-Mat. Nauk, 1985, (4), 71-74. [all data]

Karabaev, Saidov, et al., 1985
Karabaev, M.; Saidov, A.A.; Abduzhaminov, T.P.; Kenisarin, M.M., Heat capacity and molecular kinetic processes of condensed phase acrylates and methacrylates, Izv. Akad. Nauk UzSSR, Ser. Fiz.-Math., 1985, (6), 51-54. [all data]

Karabaev, Abduzhaminov, et al., 1985, 2
Karabaev, M.K.; Abduzhaminov, T.P.; Kenisarin, M.M.; Saidov, A.A., Thermodynamics of the crystal-liquid phase transition in acrylates and methacrylates., Izv. Akad. Nauk Uzb. SSR Ser., Fiz-Mat. Nauk, 1985, 1985, No. 5, 74-7. [all data]

Stephenson and Malanowski, 1987
Stephenson, Richard M.; Malanowski, Stanislaw, Handbook of the Thermodynamics of Organic Compounds, 1987, https://doi.org/10.1007/978-94-009-3173-2 . [all data]

Karabaev, Abduzhaminov, et al., 1985, 3
Karabaev, M.K.; Abduzhaminov, T.P.; Kenisarin, M.M.; Saidov, A.A., Thermodynamics of the crystal-liquid phase transition in acrylates and methacrylates, Izv. Akad. Nauk Uzb. SSR, Ser. Fiz.-Mat. Nauk, 1985, (5), 74-77. [all data]

Domalski and Hearing, 1996
Domalski, Eugene S.; Hearing, Elizabeth D., Heat Capacities and Entropies of Organic Compounds in the Condensed Phase. Volume III, J. Phys. Chem. Ref. Data, 1996, 25, 1, 1, https://doi.org/10.1063/1.555985 . [all data]