3-Methyl-3-oxetanemethanol

Kovats' RI, non-polar column, isothermal

View large format table.

Column type Active phase Temperature (C) I Reference Comment
PackedSE-30125.920.Casteignau and Halary, 1972Chromosorb P (60-80 mesh); Column length: 3. m

Phase change data

Data compiled by: Robert L. Brown and Stephen E. Stein

Reduced pressure boiling point

Tboil (K) Pressure (atm) Reference
353.20.053Aldrich Chemical Company Inc., 1990
353.0.053Farchan Laboratories, 1990

References

Casteignau and Halary, 1972
Casteignau, G.; Halary, J.-L., No. 72 - Identification et dosage par chromatographie en phase gazeuse d'oxetannes disubstitués en 3 et de quelques autres éthers-oxydes, Bull. Soc. Chim. Fr., 1972, 1, 420-428. [all data]