2-Bromo-3-methylnaphthoquinone

Gas phase ion energetics data

Data compiled as indicated in comments:
LLK - Sharon G. Lias, Rhoda D. Levin, and Sherif A. Kafafi

Ionization energy determinations

IE (eV) Method Reference Comment
9.25PERedchenko, Freimanis, et al., 1980LLK
9.63 ± 0.01PERedchenko, Freimanis, et al., 1980Vertical value; LLK

References

Redchenko, Freimanis, et al., 1980
Redchenko, V.V.; Freimanis, Y.F.; Dregeris, Y.Y., Photoelectron Spectroscopy of 2,3-Disubtituted naphthoquinones, J. Gen. Chem. USSR, 1980, 50, 1507, In original 1847. [all data]