2-Nitro-9-fluorenone

Lee's RI, non-polar column, temperature ramp

View large format table.

Column type Active phase I Reference Comment
CapillarySE-52366.80White, Robbat, et al., 198330. m/0.3 mm/0.25 μm, He, 4. K/min; Tstart: 25. C; Tend: 295. C
CapillarySE-52366.83White, Robbat, et al., 198330. m/0.2 mm/0.25 μm, He, 4. K/min; Tstart: 25. C; Tend: 295. C

Lee's RI, non-polar column, custom temperature program

View large format table.

Column type Active phase I Reference Comment
CapillaryBP-5364.7Kelly, Bartle, et al., 1992Column length: 25. m; Column diameter: 0.32 mm; Program: XX C X C/min -> 170 C 40 C/min -> 300 C (5 min); Check the values XX and X (bad xerox copy)

References

White, Robbat, et al., 1983
White, C.M.; Robbat, A., Jr.; Hoes, R.M., Gas chromatographic retention characteristics of nitrated polycyclic aromatic hydrocarbons on SE-52, Chromatographia, 1983, 17, 11, 605-612, https://doi.org/10.1007/BF02261944 . [all data]

Kelly, Bartle, et al., 1992
Kelly, G.W.; Bartle, K.D.; Clifford, A.A.; Robinson, R.E., Application of coupled LC-GC to the analysis of the polar fraction of diesel particulate matter, J. Hi. Res. Chromatogr., 1992, 15, 8, 526-530, https://doi.org/10.1002/jhrc.1240150808 . [all data]