Acetic acid, trifluoro-, nonyl ester

Kovats' RI, non-polar column, isothermal

View large format table.

Column type Active phase Temperature (C) I Reference Comment
CapillaryOV-101200.1123.6Komárek, Hornová, et al., 1982N2; Column length: 15. m; Column diameter: 0.22 mm
PackedSE-30140.1137.Zarazir, Chovin, et al., 1970Chromosorb W; Column length: 2. m

Kovats' RI, polar column, isothermal

View large format table.

Column type Active phase Temperature (C) I Reference Comment
PackedCarbowax 20M140.1270.Zarazir, Chovin, et al., 1970Chromosorb W; Column length: 2. m

Van Den Dool and Kratz RI, non-polar column, temperature ramp

View large format table.

Column type Active phase I Reference Comment
Capillary5 % Phenyl methyl siloxane1153.Zaikin, 200930. m/0.25 mm/0.25 μm, 15. K/min, 270. C @ 15. min; Tstart: 60. C
CapillaryDB-51176.3Richter, Komarek, et al., 199720. m/0.25 mm/0.25 μm, He, 5.5 K/min; Tstart: 50. C; Tend: 350. C

Van Den Dool and Kratz RI, non-polar column, custom temperature program

View large format table.

Column type Active phase I Reference Comment
CapillaryVF-5MS1156.7Zheng and White, 200830. m/0.25 mm/0.25 μm, He; Program: not specified

References

Komárek, Hornová, et al., 1982
Komárek, K.; Hornová, L.; Churácek, J., Glass capillary gas chromatography of homologous series of esters. Separation of homologous series of esters of halogenated carboxylic acids on a glass capillary column with the non-polar stationary silicone phase OV-101, J. Chromatogr., 1982, 244, 1, 142-147, https://doi.org/10.1016/S0021-9673(00)80131-4 . [all data]

Zarazir, Chovin, et al., 1970
Zarazir, D.; Chovin, P.; Guiochon, G., Identification of hydroxylic compounds and their derivatives by gas chromatography, Chromatographia, 1970, 3, 4, 180-195, https://doi.org/10.1007/BF02269018 . [all data]

Zaikin, 2009
Zaikin, V.G., Personal Communication: Retention indices measured during the period 2008 to 2009, 2009. [all data]

Richter, Komarek, et al., 1997
Richter, P.; Komarek, K.; Reznicková, I., Identification of alkylpolyethylene glycols in the residues after biodegradation of their mixtures by CGC and previous derivatization, Folia Microbiol. (Prague), 1997, 42, 5, 517-520, https://doi.org/10.1007/BF02826565 . [all data]

Zheng and White, 2008
Zheng, Y.; White, E., Retention Data. NIST Mass Spectrometry Data Center., NIST Mass Spectrometry Data Center, 2008. [all data]