Hydroperoxide, 1-methylethyl

Gas phase thermochemistry data

Data compiled by: Hussein Y. Afeefy, Joel F. Liebman, and Stephen E. Stein

Quantity Value Units Method Reference Comment
Δfgas-197.1kJ/molEqkKhursan and Martem'yanov, 1991hf from V. P.Komissarov's report

References

Khursan and Martem'yanov, 1991
Khursan, S.L.; Martem'yanov, V.S., Thermochemistry of the recombination of peroxyl radicals, Russ. J. Phys. Chem. (Engl. Transl.), 1991, 65, 321-325. [all data]