5-Hexenenitrile, 2-methyl-

Normal alkane RI, non-polar column, temperature ramp

Data compiled by: NIST Mass Spectrometry Data Center, William E. Wallace, director

Column type Capillary
Active phase DB-5
Column length (m) 30.
Carrier gas He
Substrate
Column diameter (mm) 0.25
Phase thickness (μm) 0.25
Tstart (C) 60.
Tend (C) 240.
Heat rate (K/min) 3.
Initial hold (min)
Final hold (min)
I 848.
ReferenceMiyazawa, Nishiguchi, et al., 2005
Comment MSDC-RI

References

Miyazawa, Nishiguchi, et al., 2005
Miyazawa, M.; Nishiguchi, T.; Yamafuji, C., Volatile components of the leaves of Brassica rapa L. var. perviridis Bailey, Flavour Fragr. J., 2005, 20, 2, 158-160, https://doi.org/10.1002/ffj.1335 . [all data]