Naphthalene, decahydro-1,6-bis(methylene)-4-(1-methylethyl)-, (4α,4aα,8aα)-

Kovats' RI, non-polar column, isothermal

View large format table.

Column type Active phase Temperature (C) I Reference Comment
PackedSE-30130.1445.Andersen and Falcone, 1969He, Chromosorb G

Kovats' RI, non-polar column, temperature ramp

View large format table.

Column type Active phase I Reference Comment
CapillaryDB-11457.Fiorini, Fourasté, et al., 1997He, 3. K/min; Column length: 30. m; Column diameter: 0.23 mm; Tstart: 50. C; Tend: 200. C

Kovats' RI, polar column, isothermal

View large format table.

Column type Active phase Temperature (C) I Reference Comment
PackedCarbowax 20M132.1676.Andersen and Falcone, 1969
PackedCarbowax 20M165.1714.Andersen and Falcone, 1969

Van Den Dool and Kratz RI, non-polar column, temperature ramp

View large format table.

Column type Active phase I Reference Comment
CapillaryDB-11446.bin Jantan and bin Ahmad, 2002N2, 60. C @ 10. min, 3. K/min, 180. C @ 10. min; Column length: 25. m; Column diameter: 0.25 mm

Van Den Dool and Kratz RI, non-polar column, custom temperature program

View large format table.

Column type Active phase I Reference Comment
CapillaryHP-5MS1458.8Andriamaharavo, 201430. m/0.25 mm/0.25 μm, He; Program: 60C (1 min) => 5 C/min => 210C => 10 C/min => 280C (15 min)

Normal alkane RI, non-polar column, temperature ramp

View large format table.

Column type Active phase I Reference Comment
CapillaryOV-1011465.Orav, Kailas, et al., 1996He, 2. K/min; Column length: 50. m; Column diameter: 0.25 mm; Tstart: 50. C; Tend: 250. C

Normal alkane RI, non-polar column, custom temperature program

View large format table.

Column type Active phase I Reference Comment
CapillarySE-301464.Vinogradov, 2004Program: not specified

Normal alkane RI, polar column, custom temperature program

View large format table.

Column type Active phase I Reference Comment
CapillaryCarbowax 20M1713.Vinogradov, 2004Program: not specified

References

Andersen and Falcone, 1969
Andersen, N.H.; Falcone, M.S., The identification of sesquiterpene hydrocarbons from gas-liquid chromatography retention data, J. Chromatogr., 1969, 44, 52-59, https://doi.org/10.1016/S0021-9673(01)92497-5 . [all data]

Fiorini, Fourasté, et al., 1997
Fiorini, C.; Fourasté, I.; David, B.; Bessière, J.M., Composition of the flower, leaf, and stem essential oils from Laurus nobilis L., Flavour Fragr. J., 1997, 12, 2, 91-93, https://doi.org/10.1002/(SICI)1099-1026(199703)12:2<91::AID-FFJ623>3.0.CO;2-3 . [all data]

bin Jantan and bin Ahmad, 2002
bin Jantan, I.; bin Ahmad, F., Chemical constituents of the essential oils of Goniothalamus malayanus Hook. f. and Thoms., Flavour Fragr. J., 2002, 17, 5, 372-374, https://doi.org/10.1002/ffj.1107 . [all data]

Andriamaharavo, 2014
Andriamaharavo, N.R., Retention Data. NIST Mass Spectrometry Data Center., NIST Mass Spectrometry Data Center, 2014. [all data]

Orav, Kailas, et al., 1996
Orav, A.; Kailas, T.; Liiv, M., Analysis of terpenoic composition of conifer needle oils by steam distillation/extraction, gas chromatography and gas chromatography-mass spectrometry, Chromatographia, 1996, 43, 3/4, 215-219, https://doi.org/10.1007/BF02292955 . [all data]

Vinogradov, 2004
Vinogradov, B.A., Production, composition, properties and application of essential oils, 2004, retrieved from http://viness.narod.ru. [all data]