Butanoic acid, 2-methyl-, octyl ester

Kovats' RI, non-polar column, temperature ramp

View large format table.

Column type Active phase I Reference Comment
CapillaryHP-5MS1436.Asuming, Beauchamp, et al., 200530. m/0.25 mm/0.25 μm, He, 50. C @ 10. min, 3. K/min, 250. C @ 5. min

Kovats' RI, polar column, custom temperature program

View large format table.

Column type Active phase I Reference Comment
CapillaryCarbowax1623.Rowan, Lane, et al., 199630. m/0.25 mm/0.25 μm; Program: 40C (10min) => 3C/min => 100C => 5C/min => 220C

Van Den Dool and Kratz RI, non-polar column, temperature ramp

View large format table.

Column type Active phase I Reference Comment
CapillaryDB-11421.Sonboli, Azizian, et al., 200760. m/0.25 mm/0.25 μm, N2, 5. K/min, 250. C @ 10. min; Tstart: 60. C
CapillaryHP-5MS1413.Saroglou, Dorizas, et al., 200630. m/0.25 mm/0.25 μm, He, 60. C @ 5. min, 4. K/min; Tend: 280. C
CapillaryHP-5MS1438.Vujisic L., Vuckovic I., et al., 200630. m/0.25 mm/0.25 μm, H2, 4.3 K/min; Tstart: 50. C; Tend: 285. C
CapillaryHP-51434.Javidnia, Miri, et al., 2005He, 3. K/min; Column length: 30. m; Column diameter: 0.25 mm; Tstart: 60. C; Tend: 260. C
CapillaryHP-5MS1421.Grujic-Jovanovic, Skaltsa, et al., 200430. m/0.25 mm/0.25 μm, He, 60. C @ 5. min, 4. K/min; Tend: 280. C

Normal alkane RI, non-polar column, temperature ramp

View large format table.

Column type Active phase I Reference Comment
CapillaryDB-11421.Sonboli, Kanani, et al., 200760. m/0.25 mm/0.25 μm, Nitrogen, 5. K/min, 250. C @ 10. min; Tstart: 60. C
CapillaryHP-51418.Pino, Sauri-Duch, et al., 200630. m/0.25 mm/0.25 μm, H2, 50. C @ 2. min, 4. K/min, 280. C @ 10. min
CapillaryHP-51430.Pino, Sauri-Duch, et al., 200630. m/0.25 mm/0.25 μm, H2, 50. C @ 2. min, 4. K/min, 280. C @ 10. min
CapillaryOV-1011418.Camciuc, Bessière, et al., 199850. m/0.22 mm/1. μm, He, 100. C @ 1. min, 1. K/min; Tend: 220. C
CapillaryOV-1011422.Sugisawa, Yang, et al., 1989N2, 2. K/min; Column length: 50. m; Column diameter: 0.25 mm; Tstart: 80. C; Tend: 200. C
CapillaryOV-1011422.Sugisawa, Yang, et al., 1989N2, 2. K/min; Column length: 50. m; Column diameter: 0.25 mm; Tstart: 80. C; Tend: 200. C

Normal alkane RI, non-polar column, custom temperature program

View large format table.

Column type Active phase I Reference Comment
CapillaryDB-11429.Mendes, Trindade, et al., 200930. m/0.25 mm/0.25 μm, Hydrogen; Program: 45 0C 3 0C/min -> 175 0C 15 0C/min -> 300 0C (10 min)
CapillarySE-301422.Vinogradov, 2004Program: not specified

Normal alkane RI, polar column, temperature ramp

View large format table.

Column type Active phase I Reference Comment
CapillaryCarbowax 20M1634.Kafkas and Paydas, 200725. m/0.25 mm/0.40 μm, Helium, 5. K/min, 260. C @ 40. min; Tstart: 60. C

Normal alkane RI, polar column, custom temperature program

View large format table.

Column type Active phase I Reference Comment
CapillaryCarbowax 20M1615.Vinogradov, 2004Program: not specified

References

Asuming, Beauchamp, et al., 2005
Asuming, W.A.; Beauchamp, P.S.; Descalzo, J.T.; Dev, B.C.; Dev, V.; Frost, S.; Ma, C.W., Essential oil composition of four Lomatium Raf. species and their chemotaxonomy, Biochem. Syst. Ecol., 2005, 33, 1, 17-26, https://doi.org/10.1016/j.bse.2004.06.005 . [all data]

Rowan, Lane, et al., 1996
Rowan, D.D.; Lane, H.P.; Allen, J.M.; Fielder, S.; Hunt, M.B., Biosynthesis of 2-methylbutyl, 2-methyl-2-butenyl, and 2-methylbutanoate esters in Red Delicious and Granny Smith apples using deuterium-labeled substrates, J. Agric. Food Chem., 1996, 44, 10, 3276-3285, https://doi.org/10.1021/jf9508209 . [all data]

Sonboli, Azizian, et al., 2007
Sonboli, A.; Azizian, D.; Yousefzadi, M.; Kanani, M.R.; Mehrabian, A.R., Volatile constituents and antimicrobial activity of the essential oil of Tetrataenium lasiopetalum (Apiaceae) from Iran, Flavour Fragr. J., 2007, 22, 2, 119-122, https://doi.org/10.1002/ffj.1767 . [all data]

Saroglou, Dorizas, et al., 2006
Saroglou, V.; Dorizas, N.; Kypriotakis, Z.; Skaltsa, H.D., Analysis of the essential oil composition of eight Anthemis species from Greece, J. Chromatogr. A, 2006, 1104, 1-2, 313-322, https://doi.org/10.1016/j.chroma.2005.11.087 . [all data]

Vujisic L., Vuckovic I., et al., 2006
Vujisic L.; Vuckovic I.; Tesevic V.; Dokovic D.; Ristic M.S.; Janackovic P.; Milosavljevic S., Comparative examination of the essential oils of Anthemis ruthenica and A-arvensis wild-growing in Serbia, Flavour Fragr. J., 2006, 21, 3, 458-461, https://doi.org/10.1002/ffj.1681 . [all data]

Javidnia, Miri, et al., 2005
Javidnia, K.; Miri, R.; Jamalian, A., Composition of the essential oil of Salvia macrosiphon Boiss. from Iran, Flavour Fragr. J., 2005, 20, 5, 542-543, https://doi.org/10.1002/ffj.1468 . [all data]

Grujic-Jovanovic, Skaltsa, et al., 2004
Grujic-Jovanovic, S.; Skaltsa, H.D.; Marin, P.; Sokovic, M., Composition and antibacterial activity of the essential oil of six Stachys species from Serbia, Flavour Fragr. J., 2004, 19, 2, 139-144, https://doi.org/10.1002/ffj.1275 . [all data]

Sonboli, Kanani, et al., 2007
Sonboli, A.; Kanani, M.R.; Yousefzadi, M.; Mojarrad, M., Biological activity and composition of the essential oil of Tetrataenium nephrophyllum (Apiaceae) from Iran, Natural Product Communications, 2007, 2, 12, 1249-1252. [all data]

Pino, Sauri-Duch, et al., 2006
Pino, J.; Sauri-Duch, E.; Marbot, R., Changes in volatile compounds of Habanero chile pepper (Capsicum chinense Jack. cv. Habanero) at two ripening stages, Food Chem., 2006, 94, 3, 394-398, https://doi.org/10.1016/j.foodchem.2004.11.040 . [all data]

Camciuc, Bessière, et al., 1998
Camciuc, M.; Bessière, J.M.; Vilarem, G.; Gaset, A., Volatile components in okra seed coat, Phytochemistry, 1998, 48, 2, 311-315, https://doi.org/10.1016/S0031-9422(97)01127-8 . [all data]

Sugisawa, Yang, et al., 1989
Sugisawa, H.; Yang, R.H.; Kawabata, C.; Tamura, H., Volatile constituents in the peel oil of sudachi (Citrus sudachi), Agric. Biol. Chem., 1989, 53, 6, 1721-1723, https://doi.org/10.1271/bbb1961.53.1721 . [all data]

Mendes, Trindade, et al., 2009
Mendes, M.D.; Trindade, H.; Figueiredo, A.C.; Barroso, J.G.; Fontinha, S.S.; Pedro, L.G., Volatile and molecular characterization of two Portuguese endemic species: Angelica lignescens and Melanoselinium decipiens, Biochen. Systematics Ecol., 2009, 37, 2, 98-105, https://doi.org/10.1016/j.bse.2008.12.006 . [all data]

Vinogradov, 2004
Vinogradov, B.A., Production, composition, properties and application of essential oils, 2004, retrieved from http://viness.narod.ru. [all data]

Kafkas and Paydas, 2007
Kafkas, E.; Paydas, S., Evaluation and identification of volatile compounds of some promising strawberry genotypes using HS-SPME technique by GC-MS, World J. Agric. Sci., 2007, 3, 2, 191-195. [all data]