Cyclotriacontane

Condensed phase thermochemistry data

Data compiled by: Hussein Y. Afeefy, Joel F. Liebman, and Stephen E. Stein

Quantity Value Units Method Reference Comment
Δcsolid-19484. ± 29.kJ/molCcbRuzieka and Schlapfer, 1933Reanalyzed by Cox and Pilcher, 1970, Original value = -19460. kJ/mol; Corresponding Δfsolid = -895.71 kJ/mol (simple calculation by NIST; no Washburn corrections)

References

Ruzieka and Schlapfer, 1933
Ruzieka, L.; Schlapfer, P., Zur kenntnis des kohlenstoffringes XXII. Uber die verbrennungswarme bei hochgliedrigen ringverbindungen, Helv. Chim. Acta, 1933, 16, 162-169. [all data]

Cox and Pilcher, 1970
Cox, J.D.; Pilcher, G., Thermochemistry of Organic and Organometallic Compounds, Academic Press, New York, 1970, 1-636. [all data]