Ethane, 1-chloro-1,1-dinitro-

Phase change data

Data compiled by: Hussein Y. Afeefy, Joel F. Liebman, and Stephen E. Stein

Quantity Value Units Method Reference Comment
Δvap43.5kJ/molVPepekin and Korsunskii, 1995

References

Pepekin and Korsunskii, 1995
Pepekin, V.I.; Korsunskii, B.L., Thermochemistry of halopolynitroalkanes, Dokl. Phys. Chem. (Engl. Transl.), 1995, 340, 14-16, In original 342. [all data]