10,10-Dimethyl-9-oxa-10-sila-9,10-dihydrophenanthrene

Gas phase ion energetics data

Data compiled as indicated in comments:
LBLHLM - Sharon G. Lias, John E. Bartmess, Joel F. Liebman, John L. Holmes, Rhoda D. Levin, and W. Gary Mallard

Ionization energy determinations

IE (eV) Method Reference Comment
7.0PETraven', Redchenko, et al., 1982LBLHLM

References

Traven', Redchenko, et al., 1982
Traven', V.F.; Redchenko, V.V.; Stepanov, B.I., Parameterization of quantum-chemical calculations of organic compounds of silicon by means of photoelectron spectroscopy and the electronic spectroscopy of ctc, J. Gen. Chem. USSR, 1982, 52, 2015, In original 2262. [all data]