1,3-Dioxepin

Gas phase ion energetics data

Data compiled by: Sharon G. Lias, John E. Bartmess, Joel F. Liebman, John L. Holmes, Rhoda D. Levin, and W. Gary Mallard

Ionization energy determinations

IE (eV) Method Reference Comment
8.0PEJorgensen, Gajhede, et al., 1985
8.3PEJorgensen, Gajhede, et al., 1985Vertical value

References

Jorgensen, Gajhede, et al., 1985
Jorgensen, F.S.; Gajhede, M.; Frei, B., 227. Cyclic acetals. Structural analysis of 1,3 dioxepine and related compounds, Helv. Chim. Acta, 1985, 68, 2148. [all data]