Tert-butyldifluorophosphine

Gas phase ion energetics data

Data compiled as indicated in comments:
LLK - Sharon G. Lias, Rhoda D. Levin, and Sherif A. Kafafi

Ionization energy determinations

IE (eV) Method Reference Comment
9.2PELappert, Pedley, et al., 1975LLK
9.65PELappert, Pedley, et al., 1975Vertical value; LLK

References

Lappert, Pedley, et al., 1975
Lappert, M.F.; Pedley, J.B.; Wilkins, B.T.; Stelzer, O.; Unger, E., Bonding studies of compounds of boron and the group 3-5 elements. Part XIII. He(I) photoelectron spectra of phosphines RnPX3-n (R=Me or Bu'; X=H, Cl, or F; n=1-3), (Me2N)nPCl3-n(n=1-3), and (R2N)PF2(R=Me or Et), J. Chem. Soc. Dalton Trans., 1975, 1207. [all data]