1,3-Benzenediamine, 2,4-dinitro-N3,N3-dipropyl-6-(trifluoromethyl)-

Van Den Dool and Kratz RI, non-polar column, temperature ramp

View large format table.

Column type Active phase I Reference Comment
CapillaryVF-5MS1952.N/A30. m/0.25 mm/0.25 μm, He; Tstart: 60. C; Tend: 270. C

Normal alkane RI, non-polar column, custom temperature program

View large format table.

Column type Active phase I Reference Comment
CapillaryHP-51941.Kawara, Asada, et al., 200530. m/0.25 mm/0.25 μm; Program: 50 0C (1 min) 20 0C/min -> 150 0C 10 0C/min -> 280 0C

References

Kawara, Asada, et al., 2005
Kawara, K.; Asada, T.; Oikawa, K.; Tanabe, A., Multiresidue determination of pesticides in sediments by ultrasonically assisted extraction and gas chromatography/mass spectrometry, J. AOAC International, 2005, 88, 5, 1440-1451. [all data]