[1,2,3,4]Tetrathiane

Van Den Dool and Kratz RI, non-polar column, temperature ramp

View large format table.

Column type Active phase I Reference Comment
CapillaryDB-11278.Rochat S., de Saint Laumer J.Y., et al., 200720. m/0.18 mm/0.18 μm, 60. C @ 3. min, 8. K/min, 220. C @ 5. min

References

Rochat S., de Saint Laumer J.Y., et al., 2007
Rochat S.; de Saint Laumer J.Y.; Chaintreau A., Analysis of sulfur compounds from the in-oven roast beef aroma by comprehensive two-dimensional gas chromatography, J. Chromatogr. A, 2007, 1147, 1, 85-94, https://doi.org/10.1016/j.chroma.2007.02.039 . [all data]