D-Mannaric acid, 1,4:3,6-dilactone

Condensed phase thermochemistry data

Data compiled by: Hussein Y. Afeefy, Joel F. Liebman, and Stephen E. Stein

Quantity Value Units Method Reference Comment
Δcsolid-2153.4 ± 2.6kJ/molCcbStroh and Kuchenmeister, 1964Corresponding Δfsolid = -1065.2 kJ/mol (simple calculation by NIST; no Washburn corrections)

References

Stroh and Kuchenmeister, 1964
Stroh, H.H.; Kuchenmeister, W., Verbrennungswarmen von zuckerderivaten, Z. Chem., 1964, 4, 427-428. [all data]