2,2,6,6-tetramethyl-4-oxopiperidinooxy

Gas phase thermochemistry data

Data compiled by: Hussein Y. Afeefy, Joel F. Liebman, and Stephen E. Stein

Quantity Value Units Method Reference Comment
Δfgas-215.3 ± 6.5kJ/molCcbLebedev, Rozantzev, et al., 1966

References

Lebedev, Rozantzev, et al., 1966
Lebedev, Yu.A.; Rozantzev, E.G.; Kalashnikova, L.A.; Lebedev, V.P.; Neiman, M.B.; Apin, A.Ya., Thermochemical study of certain free radicals and the corresponding hydrides, Dokl. Phys. Chem. (Engl. Transl.), 1966, 168, 460-462, In original 104. [all data]