Delorazepam

Kovats' RI, non-polar column, isothermal

Data compiled by: NIST Mass Spectrometry Data Center, William E. Wallace, director

Column type CapillaryCapillaryPacked
Active phase BP-1DB-1SE-30
Column length (m) 25.30.2.
Carrier gas N2N2N2
Substrate   1% se-30 on Anachrom ABS(80-100mesh)
Column diameter (mm) 0.220.53
Phase thickness (μm) 0.251.5
Temperature (C) 250.250.240.
I 2571.2593.2569.
ReferenceWeston, Japp, et al., 1991Weston, Japp, et al., 1991Musumarra, Scarlata, et al., 1987
Comment MSDC-RI MSDC-RI MSDC-RI

Normal alkane RI, non-polar column, temperature ramp

Data compiled by: NIST Mass Spectrometry Data Center, William E. Wallace, director

Column type CapillaryCapillary
Active phase BP-1DB-5
Column length (m)  15.
Carrier gas  He
Substrate
Column diameter (mm)  0.25
Phase thickness (μm)  0.25
Tstart (C) 100.150.
Tend (C) 300.260.
Heat rate (K/min)  10.
Initial hold (min)  1.
Final hold (min)
I 2537.2537.
ReferenceMHA, 9999Zamechnik, Ethier, et al., 1989
Comment MSDC-RI MSDC-RI

References

Weston, Japp, et al., 1991
Weston, S.I.; Japp, M.; Partridge, J.; Osselton, M.D., Collection of analytical data for benzodiazepines and benzophenones. Appendix, J. Chromatogr., 1991, 538, 2, 277-284, https://doi.org/10.1016/S0021-9673(01)88848-8 . [all data]

Musumarra, Scarlata, et al., 1987
Musumarra, G.; Scarlata, G.; Romano, G.; Cappello, G.; Clementi, S.; Giulietti, G., Qualitative organic analysis. Part 2. Identification of drugs by principal components analysis of standardized TLC data in four eluent systems and of retention indices on SE 30, J. Anal. Toxicol., 1987, 11, 4, 154-163, https://doi.org/10.1093/jat/11.4.154 . [all data]