1-Octadecanethiol

Condensed phase thermochemistry data

Data compiled by: Eugene S. Domalski and Elizabeth D. Hearing

Constant pressure heat capacity of liquid

Cp,liquid (J/mol*K) Temperature (K) Reference Comment
648.61300.Tutubalina, Gabdrakhmanov, et al., 1982T = 273 to 373 K. Cp = 626.52 + 4.423x10-2T + 9.800x10-5T2.

References

Tutubalina, Gabdrakhmanov, et al., 1982
Tutubalina, V.P.; Gabdrakhmanov, F.G.; Konyukhova, T.M., Study of the heat capacity of n-sulfides, 1982, Teplo-Massoobmen Khim. [all data]