Tricyclo[4.1.0.0(2,7)]heptane

Reaction thermochemistry data

Data compiled by: Hussein Y. Afeefy, Joel F. Liebman, and Stephen E. Stein

Individual Reactions

Tricyclo[4.1.0.0(2,7)]heptane = 3-Methylenecyclohexene

By formula: C7H10 = C7H10

Quantity Value Units Method Reference Comment
Δr-125.5 ± 0.3kJ/molCisoWiberg and Connon, 1976liquid phase; solvent: Chloroform

References

Wiberg and Connon, 1976
Wiberg, K.B.; Connon, H.A., Enthalpy of the metal catalyzed isomerizations of quadricyclane and of tricyclo[4.1.0.02,7]heptane, J. Am. Chem. Soc., 1976, 98, 5411-5412. [all data]