Cyclohexane, 1-methyl-4-methylene-

Kovats' RI, non-polar column, isothermal

View large format table.

Column type Active phase Temperature (C) I Reference Comment
CapillarySE-3080.803.5Albaigés and Guardino, 1980He; Column length: 64. m; Column diameter: 0.25 mm
CapillarySqualane80.800.7Albaigés and Guardino, 1980He; Column length: 100. m; Column diameter: 0.25 mm

References

Albaigés and Guardino, 1980
Albaigés, J.; Guardino, X., Gas chromatographic-mass spectrometric identification of alkylcyclohexanes and cyclohexenes, Chromatographia, 1980, 13, 12, 755-762, https://doi.org/10.1007/BF02265555 . [all data]