Pyrimidine,4,6-difluoro-

Gas phase ion energetics data

Data compiled by: Sharon G. Lias, Rhoda D. Levin, and Sherif A. Kafafi

Ionization energy determinations

IE (eV) Method Reference Comment
10.95PEVan den Ham, Van der Meer, et al., 1974Vertical value

References

Van den Ham, Van der Meer, et al., 1974
Van den Ham, D.M.W.; Van der Meer, D.; Feil, D., Photoelectron spectra of fluorine-substituted diazabenzenes, J. Electron Spectrosc. Relat. Phenom., 1974, 3, 479. [all data]