8-Azabicyclo[3.2.1]octane

Phase change data

Data compiled by: Robert L. Brown and Stephen E. Stein

Quantity Value Units Method Reference Comment
Tboil434.KN/ABuckingham and Donaghy, 1982
Quantity Value Units Method Reference Comment
Tfus333.KN/ABuckingham and Donaghy, 1982

References

Buckingham and Donaghy, 1982
Buckingham, J.; Donaghy, S.M., Dictionary of Organic Compounds: Fifth Edition, Chapman and Hall, New York, 1982, 1. [all data]