(Z)-2-Pentenoic acid ethyl ester

Phase change data

Data compiled as indicated in comments:
ALS - Hussein Y. Afeefy, Joel F. Liebman, and Stephen E. Stein
DRB - Donald R. Burgess, Jr.

Quantity Value Units Method Reference Comment
Δvap46. ± 1.kJ/molESchjanberg, 1938Heat of formation derived by Cox and Pilcher, 1970; ALS
Δvap46.0kJ/molN/ASchjanberg, 1938DRB

Gas phase thermochemistry data

Data compiled by: Hussein Y. Afeefy, Joel F. Liebman, and Stephen E. Stein

Quantity Value Units Method Reference Comment
Δfgas-395. ± 3.kJ/molCcbSchjanberg, 1938Heat of formation derived by Cox and Pilcher, 1970

References

Schjanberg, 1938
Schjanberg, E., Cis-pentensyreetylestrarnas forbranningsvarmen, refraktionsdata och alkaliska hydrolys, Svensk. Kim. Tidr., 1938, 50, 102-106. [all data]

Cox and Pilcher, 1970
Cox, J.D.; Pilcher, G., Thermochemistry of Organic and Organometallic Compounds, Academic Press, New York, 1970, 1-636. [all data]