1,4-Ethenoanthracene, 1,4-dihydro-

Lee's RI, non-polar column, temperature ramp

View large format table.

Column type Active phase I Reference Comment
CapillaryHP-5342.20Piao, Chu, et al., 199930. m/0.25 mm/0.25 μm, 50. C @ 2. min, 4. K/min, 280. C @ 20. min
CapillaryDB-5335.8Durlak, Biswas, et al., 199830. m/0.25 mm/0.25 μm, 15. K/min; Tstart: 50. C; Tend: 300. C

Lee's RI, non-polar column, custom temperature program

View large format table.

Column type Active phase I Reference Comment
CapillaryDB-5MS336.6Aracil, Font, et al., 2005Column length: 60. m; Column diameter: 0.25 mm; Program: not specified

References

Piao, Chu, et al., 1999
Piao, M.; Chu, S.; Zheng, M.; Xu, X., Characterization of the combustion products of polyethylene, Chemosphere, 1999, 39, 9, 1497-1512, https://doi.org/10.1016/S0045-6535(99)00054-5 . [all data]

Durlak, Biswas, et al., 1998
Durlak, S.K.; Biswas, P.; Shi, J.; Bernhard, M.J., Characterization of polycyclic aromatic hydrocarbon particulate and gaseous emissions from polystyrene combustion, Environ. Sci. Technol., 1998, 32, 15, 2301-2307, https://doi.org/10.1021/es9709031 . [all data]

Aracil, Font, et al., 2005
Aracil, I.; Font, R.; Conesa, J.A., Semivolatile and volatile compounds from the pyrolysis and combustion of polyvinyl chloride, J. Anal. Appl. Pyrolysis, 2005, 74, 1-2, 465-478, https://doi.org/10.1016/j.jaap.2004.09.008 . [all data]