2-Propenoic acid, 3-methoxybutyl ester

Kovats' RI, non-polar column, isothermal

View large format table.

Column type Active phase Temperature (C) I Reference Comment
PackedApiezon L120.905.Bogoslovsky, Anvaer, et al., 1978Celite 545
PackedApiezon L160.913.Bogoslovsky, Anvaer, et al., 1978Celite 545

References

Bogoslovsky, Anvaer, et al., 1978
Bogoslovsky, Yu.N.; Anvaer, B.I.; Vigdergauz, M.S., Chromatographic constants in gas chromatography (in Russian), Standards Publ. House, Moscow, 1978, 192. [all data]