4,4'-oxybis(benzene-1,2-diamine)

Gas phase thermochemistry data

Data compiled by: Hussein Y. Afeefy, Joel F. Liebman, and Stephen E. Stein

Quantity Value Units Method Reference Comment
Δcgas-6632. ± 2.kJ/molCcbKaryakin, Rabinovich, et al., 1977Hfusion=6.047±0.07 kcal/mol at 425.1K

Condensed phase thermochemistry data

Data compiled as indicated in comments:
ALS - Hussein Y. Afeefy, Joel F. Liebman, and Stephen E. Stein
DH - Eugene S. Domalski and Elizabeth D. Hearing

Quantity Value Units Method Reference Comment
Δfliquid-21.7 ± 0.4kcal/molCcbKaryakin, Rabinovich, et al., 1977Hfusion=6.047±0.07 kcal/mol at 425.1K; ALS
Quantity Value Units Method Reference Comment
solid,1 bar70.24cal/mol*KN/AKaryakin, Rabinovich, et al., 1977DH
solid,1 bar70.53cal/mol*KN/AKaryakin, Sapozhnikov, et al., 1973DH

Constant pressure heat capacity of solid

Cp,solid (cal/mol*K) Temperature (K) Reference Comment
95.6300.Karyakin, Rabinovich, et al., 1977T = 100 to 700 K. Data given graphically. Value estimated from graph.; DH
76.539300.Karyakin, Sapozhnikov, et al., 1973T = 20 to 300 K.; DH

Phase change data

Data compiled as indicated in comments:
TRC - Thermodynamics Research Center, NIST Boulder Laboratories, Chris Muzny director
DH - Eugene S. Domalski and Elizabeth D. Hearing
AC - William E. Acree, Jr., James S. Chickos

Quantity Value Units Method Reference Comment
Ttriple402.6KN/AKaryakin, Rabinovich, et al., 1977, 2Uncertainty assigned by TRC = 0.1 K; TRC

Enthalpy of fusion

ΔfusH (kcal/mol) Temperature (K) Reference Comment
6.0471425.1Karyakin, Rabinovich, et al., 1977DH
6.05402.6Domalski and Hearing, 1990AC

Entropy of fusion

ΔfusS (cal/mol*K) Temperature (K) Reference Comment
15.0425.1Karyakin, Rabinovich, et al., 1977DH

In addition to the Thermodynamics Research Center (TRC) data available from this site, much more physical and chemical property data is available from the following TRC products:

References

Karyakin, Rabinovich, et al., 1977
Karyakin, N.V.; Rabinovich, I.B.; Sapozhnikov, V.N.; Kamelova, G.P.; Krongauz, E.S.; Korshak, V.V.; Travnikova, A.P., Thermodynamics of the synthesis of poly[(2,2'-1,4-phenylene)-7,7'-oxy-bix(3-phenylquinoxaline)], Vysokomol. Soedin., Ser. B, 1977, 19, 457-460. [all data]